{"text_format":"1","workbook":"xlsx","n_sheets":5,"sheets":["AEG Input File","LC","DLC-Smart TS","3rd party cont.","Inflation"],"not_rendered":{"charts":1,"images":0,"macros":1,"external_links":1,"defined_names":44,"comments":2,"pivot_tables":0},"unopened":[],"bounds":{"document_bytes":16777216,"sheet_cells":100000,"rows_first":2000,"rows_last":500,"rows_between":2000,"halvings":0,"cell_chars":16384,"cell_head_chars":4096},"cells_cut":0,"cells_raw":0,"read":"whole","date_system":"1900"}

{"sheet":"AEG Input File","index":0,"n_rows":16,"n_cols":76,"rows_kept":16,"cut":false,"hidden":false,"merged":[]}
[null,null,null,null,"Dth","Dth","Dth","Dth","Dth","Dth","Dth","Dth","Dth","Dth","Dth","Dth","Dth","Dth","Dth","Dth","Dth","Dth","Dth","Dth","Dth","Dth","Dth","Dth","Capital Expense Costs","Capital Expense Costs","Capital Expense Costs","Capital Expense Costs","Capital Expense Costs","Capital Expense Costs","Capital Expense Costs","Capital Expense Costs","Capital Expense Costs","Capital Expense Costs","Capital Expense Costs","Capital Expense Costs","Capital Expense Costs","Capital Expense Costs","Capital Expense Costs","Capital Expense Costs","Capital Expense Costs","Capital Expense Costs","Capital Expense Costs","Capital Expense Costs","Capital Expense Costs","Capital Expense Costs","Capital Expense Costs","Capital Expense Costs","O&M Costs","O&M Costs","O&M Costs","O&M Costs","O&M Costs","O&M Costs","O&M Costs","O&M Costs","O&M Costs","O&M Costs","O&M Costs","O&M Costs","O&M Costs","O&M Costs","O&M Costs","O&M Costs","O&M Costs","O&M Costs","O&M Costs","O&M Costs","O&M Costs","O&M Costs","O&M Costs","O&M Costs"]
[null,"Row Labels","Option","Start Year",2023,2024,2025,2026,2027,2028,2029,2030,2031,2032,2033,2034,2035,2036,2037,2038,2039,2040,2041,2042,2043,2044,2045,2046,2023,2024,2025,2026,2027,2028,2029,2030,2031,2032,2033,2034,2035,2036,2037,2038,2039,2040,2041,2042,2043,2044,2045,2046,2023,2024,2025,2026,2027,2028,2029,2030,2031,2032,2033,2034,2035,2036,2037,2038,2039,2040,2041,2042,2043,2044,2045,2046]
[2,"Stand Alone","Behavioral",2023,0,0,0,0,0,0,0,0,0,0,0,0,0,0,0,0,0,0,0,0,0,0,0,0,0,0,0,0,0,0,0,0,0,0,0,0,0,0,0,0,0,0,0,0,0,0,0,0,null,0,0,0,0,0,0,0,0,0,0,0,0,0,0,0,0,0,0,0,0,0,0,0]
[3,"Stand Alone","DLC Water Heating",2023,null,null,null,null,null,null,null,null,null,null,null,null,null,null,null,null,null,null,null,null,null,null,null,null,0,0,0,0,0,0,0,0,0,0,0,0,0,0,0,0,0,0,0,0,0,0,0,0,null,0,0,0,0,0,0,0,0,0,0,0,0,0,0,0,0,0,0,0,0,0,0,0]
[4,"Stand Alone","DLC Smart Thermostats - BYOT",2023,0,8.5644866723550024,26.154741138199313,62.204895029283719,81.264855525085878,91.672883278892144,93.077011641629156,94.507179972427821,95.855690104405184,97.226647103279362,98.620443272773741,100.03747786602869,101.47815720914895,102.94289482694917,104.43211157093769,105.94623574957708,107.48570326086329,109.05095772726358,110.64245063305631,112.26064146411383,113.90599785017397,115.57899570964227,117.28011939697191,119.00986185266572,0,52107.913945660679,103963.32458048206,209568.02754861294,112940.51235100631,63403.574836640204,11373.560906932757,11544.924309797336,10298.741323270982,10431.66833032049,10567.023070547553,10704.855028644661,10845.214156832815,10988.142268960521,11133.687332204468,11281.909303233464,11432.839803558911,11586.548418555989,11743.08506564715,11902.494315857612,12064.835750725768,12230.172441806171,12398.544609152157,12570.03399066867,null,70019.356294717072,128104.30185107808,246853.39165450813,310231.76501889282,345267.57929070434,350642.2790483053,356124.02319397154,361233.78311170399,366434.53726060671,371727.97616220219,377115.81479118526,382599.81001208152,388181.73519388656,393863.42064705322,399646.70810717152,405533.49996556062,411525.69909969333,417625.29013993178,423834.25306887616,430154.63313552539,436588.4977121863,443137.96288450452,449805.18809915584]
[5,"Stand Alone","Time-of-Use",2023,0,0,0,0,0,0,0,0,0,0,0,0,0,0,0,0,0,0,0,0,0,0,0,0,0,0,0,0,0,0,0,0,0,0,0,0,0,0,0,0,0,0,0,0,0,0,0,0,null,0,0,0,0,0,0,0,0,0,0,0,0,0,0,0,0,0,0,0,0,0,0,0]
[6,"Stand Alone","Variable Peak Pricing",2023,0,0,0,0,0,0,0,0,0,0,0,0,0,0,0,0,0,0,0,0,0,0,0,0,0,0,0,0,0,0,0,0,0,0,0,0,0,0,0,0,0,0,0,0,0,0,0,0,null,0,0,0,0,0,0,0,0,0,0,0,0,0,0,0,0,0,0,0,0,0,0,0]
[7,"Stand Alone","Third Party Contracts",2023,0,0.42481879154858654,0.67917398002323937,0.84927954619980706,0.84961401713701368,0.84994861979858383,0.85028335423639478,0.85061822050234359,0.85095321864834816,0.8512883487263464,0.85162361078829729,0.85195900488617959,0.85229453107199316,0.85263018939775803,0.85296597991551448,0.85330190267732375,0.85363795773526763,0.85397414514144787,0.85431046494798701,0.85464691720702868,0.85498350197073592,0.85532021929129287,0.85565706922090479,0.85599405181179655,0,15014.283044754402,14897.168242718009,14760.023633523602,14623.037387395394,14486.301667498316,14349.833403401297,14213.649441836757,14077.766537537957,13942.201344156989,13806.970405274169,13672.090145509012,13537.576861743159,13403.44671446517,13269.715719247039,13136.39973836199,13003.514472552861,12871.075452960124,12739.098033218312,12607.597381729307,12476.588474120608,12346.086085896437,12216.104785289104,12086.658926317717,null,81825.802478013211,81410.724835764297,80811.443818369444,80065.133772215064,79320.194617014364,78576.707164477688,77834.772290670924,77094.476731102244,76355.9101093028,75619.17449412703,74884.338585701727,74151.506286000891,73420.764343738279,72692.195615879784,71965.891568553372,71241.927234111034,70520.398366648587,69801.390271033684,69084.975257997561,68371.239697549434,67660.262829979591,66952.131437426797,66246.91370068524]
[]
[]
{"$rows_left_out":7}
{"sheet":"LC","index":1,"n_rows":33,"n_cols":25,"rows_kept":33,"cut":false,"hidden":false,"merged":[]}
[]
[null,null,2,3,4,5,6,7,8,9,10,11,12,13,14,15,16,17,18,19,20,21,22,23,24]
["Revenue Requirement","Levelization",2023,2024,2025,2026,2027,2028,2029,2030,2031,2032,2033,2034,2035,2036,2037,2038,2039,2040,2041,2042,2043,2044,2045]
["Behavioral",{"$f":"IFERROR(-PMT($B$31,24,NPV($B$31,LC!C4:Y4)),0)","v":0},{"$f":"IFERROR(-PMT($B$31,24,NPV($B$31,LC!D4:Z4)),0)","v":0},{"$f":"IFERROR(-PMT($B$31,24,NPV($B$31,LC!E4:AA4)),0)","v":0},{"$f":"IFERROR(-PMT($B$31,24,NPV($B$31,LC!F4:AB4)),0)","v":0},{"$f":"IFERROR(-PMT($B$31,24,NPV($B$31,LC!G4:AC4)),0)","v":0},{"$f":"IFERROR(-PMT($B$31,24,NPV($B$31,LC!H4:AD4)),0)","v":0},{"$f":"IFERROR(-PMT($B$31,24,NPV($B$31,LC!I4:AE4)),0)","v":0},{"$f":"IFERROR(-PMT($B$31,24,NPV($B$31,LC!J4:AF4)),0)","v":0},{"$f":"IFERROR(-PMT($B$31,24,NPV($B$31,LC!K4:AG4)),0)","v":0},{"$f":"IFERROR(-PMT($B$31,24,NPV($B$31,LC!L4:AH4)),0)","v":0},{"$f":"IFERROR(-PMT($B$31,24,NPV($B$31,LC!M4:AI4)),0)","v":0},{"$f":"IFERROR(-PMT($B$31,24,NPV($B$31,LC!N4:AJ4)),0)","v":0},{"$f":"IFERROR(-PMT($B$31,24,NPV($B$31,LC!O4:AK4)),0)","v":0},{"$f":"IFERROR(-PMT($B$31,24,NPV($B$31,LC!P4:AL4)),0)","v":0},{"$f":"IFERROR(-PMT($B$31,24,NPV($B$31,LC!Q4:AM4)),0)","v":0},{"$f":"IFERROR(-PMT($B$31,24,NPV($B$31,LC!R4:AN4)),0)","v":0},{"$f":"IFERROR(-PMT($B$31,24,NPV($B$31,LC!S4:AO4)),0)","v":0},{"$f":"IFERROR(-PMT($B$31,24,NPV($B$31,LC!T4:AP4)),0)","v":0},{"$f":"IFERROR(-PMT($B$31,24,NPV($B$31,LC!U4:AQ4)),0)","v":0},{"$f":"IFERROR(-PMT($B$31,24,NPV($B$31,LC!V4:AR4)),0)","v":0},{"$f":"IFERROR(-PMT($B$31,24,NPV($B$31,LC!W4:AS4)),0)","v":0},{"$f":"IFERROR(-PMT($B$31,24,NPV($B$31,LC!X4:AT4)),0)","v":0},{"$f":"IFERROR(-PMT($B$31,24,NPV($B$31,LC!Y4:AU4)),0)","v":0},{"$f":"IFERROR(-PMT($B$31,24,NPV($B$31,LC!Z4:AV4)),0)","v":0}]
["DLC Water Heating",{"$f":"IFERROR(-PMT($B$31,24,NPV($B$31,LC!C5:Y5)),0)","v":0},{"$f":"IFERROR(-PMT($B$31,24,NPV($B$31,LC!D5:Z5)),0)","v":0},{"$f":"IFERROR(-PMT($B$31,24,NPV($B$31,LC!E5:AA5)),0)","v":0},{"$f":"IFERROR(-PMT($B$31,24,NPV($B$31,LC!F5:AB5)),0)","v":0},{"$f":"IFERROR(-PMT($B$31,24,NPV($B$31,LC!G5:AC5)),0)","v":0},{"$f":"IFERROR(-PMT($B$31,24,NPV($B$31,LC!H5:AD5)),0)","v":0},{"$f":"IFERROR(-PMT($B$31,24,NPV($B$31,LC!I5:AE5)),0)","v":0},{"$f":"IFERROR(-PMT($B$31,24,NPV($B$31,LC!J5:AF5)),0)","v":0},{"$f":"IFERROR(-PMT($B$31,24,NPV($B$31,LC!K5:AG5)),0)","v":0},{"$f":"IFERROR(-PMT($B$31,24,NPV($B$31,LC!L5:AH5)),0)","v":0},{"$f":"IFERROR(-PMT($B$31,24,NPV($B$31,LC!M5:AI5)),0)","v":0},{"$f":"IFERROR(-PMT($B$31,24,NPV($B$31,LC!N5:AJ5)),0)","v":0},{"$f":"IFERROR(-PMT($B$31,24,NPV($B$31,LC!O5:AK5)),0)","v":0},{"$f":"IFERROR(-PMT($B$31,24,NPV($B$31,LC!P5:AL5)),0)","v":0},{"$f":"IFERROR(-PMT($B$31,24,NPV($B$31,LC!Q5:AM5)),0)","v":0},{"$f":"IFERROR(-PMT($B$31,24,NPV($B$31,LC!R5:AN5)),0)","v":0},{"$f":"IFERROR(-PMT($B$31,24,NPV($B$31,LC!S5:AO5)),0)","v":0},{"$f":"IFERROR(-PMT($B$31,24,NPV($B$31,LC!T5:AP5)),0)","v":0},{"$f":"IFERROR(-PMT($B$31,24,NPV($B$31,LC!U5:AQ5)),0)","v":0},{"$f":"IFERROR(-PMT($B$31,24,NPV($B$31,LC!V5:AR5)),0)","v":0},{"$f":"IFERROR(-PMT($B$31,24,NPV($B$31,LC!W5:AS5)),0)","v":0},{"$f":"IFERROR(-PMT($B$31,24,NPV($B$31,LC!X5:AT5)),0)","v":0},{"$f":"IFERROR(-PMT($B$31,24,NPV($B$31,LC!Y5:AU5)),0)","v":0},{"$f":"IFERROR(-PMT($B$31,24,NPV($B$31,LC!Z5:AV5)),0)","v":0}]
["DLC Smart Thermostats - BYOT",{"$f":"-PMT($B$31,24,NPV($B$31,LC!C6:Y6))","v":456521.78636848484},{"$f":"VLOOKUP(C$3,'DLC-Smart TS'!$A$28:$S$50,19,FALSE)","v":0},{"$f":"VLOOKUP(D$3,'DLC-Smart TS'!$A$28:$S$50,19,FALSE)","v":88454.879765453661},{"$f":"VLOOKUP(E$3,'DLC-Smart TS'!$A$28:$S$50,19,FALSE)","v":178103.98881350571},{"$f":"VLOOKUP(F$3,'DLC-Smart TS'!$A$28:$S$50,19,FALSE)","v":363520.35365639866},{"$f":"VLOOKUP(G$3,'DLC-Smart TS'!$A$28:$S$50,19,FALSE)","v":465439.3273706644},{"$f":"VLOOKUP(H$3,'DLC-Smart TS'!$A$28:$S$50,19,FALSE)","v":524045.27981151029},{"$f":"VLOOKUP(I$3,'DLC-Smart TS'!$A$28:$S$50,19,FALSE)","v":535324.9713321767},{"$f":"VLOOKUP(J$3,'DLC-Smart TS'!$A$28:$S$50,19,FALSE)","v":547698.16510856373},{"$f":"VLOOKUP(K$3,'DLC-Smart TS'!$A$28:$S$50,19,FALSE)","v":560180.73801932449},{"$f":"VLOOKUP(L$3,'DLC-Smart TS'!$A$28:$S$50,19,FALSE)","v":573674.36583092157},{"$f":"VLOOKUP(M$3,'DLC-Smart TS'!$A$28:$S$50,19,FALSE)","v":588079.17192225286},{"$f":"VLOOKUP(N$3,'DLC-Smart TS'!$A$28:$S$50,19,FALSE)","v":597721.9645956147},{"$f":"VLOOKUP(O$3,'DLC-Smart TS'!$A$28:$S$50,19,FALSE)","v":602778.95721185952},{"$f":"VLOOKUP(P$3,'DLC-Smart TS'!$A$28:$S$50,19,FALSE)","v":597512.08748308953},{"$f":"VLOOKUP(Q$3,'DLC-Smart TS'!$A$28:$S$50,19,FALSE)","v":605476.47033881396},{"$f":"VLOOKUP(R$3,'DLC-Smart TS'!$A$28:$S$50,19,FALSE)","v":620790.73685294332},{"$f":"VLOOKUP(S$3,'DLC-Smart TS'!$A$28:$S$50,19,FALSE)","v":643557.51040480041},{"$f":"VLOOKUP(T$3,'DLC-Smart TS'!$A$28:$S$50,19,FALSE)","v":667209.38507135038},{"$f":"VLOOKUP(U$3,'DLC-Smart TS'!$A$28:$S$50,19,FALSE)","v":691957.81472743605},{"$f":"VLOOKUP(V$3,'DLC-Smart TS'!$A$28:$S$50,19,FALSE)","v":717656.91363709536},{"$f":"VLOOKUP(W$3,'DLC-Smart TS'!$A$28:$S$50,19,FALSE)","v":744344.12683901738},{"$f":"VLOOKUP(X$3,'DLC-Smart TS'!$A$28:$S$50,19,FALSE)","v":772058.37361392169},{"$f":"VLOOKUP(Y$3,'DLC-Smart TS'!$A$28:$S$50,19,FALSE)","v":800840.14215961914}]
["Time-of-Use",{"$f":"IFERROR(-PMT($B$31,24,NPV($B$31,LC!C7:Y7)),0)","v":0},{"$f":"IFERROR(-PMT($B$31,24,NPV($B$31,LC!D7:Z7)),0)","v":0},{"$f":"IFERROR(-PMT($B$31,24,NPV($B$31,LC!E7:AA7)),0)","v":0},{"$f":"IFERROR(-PMT($B$31,24,NPV($B$31,LC!F7:AB7)),0)","v":0},{"$f":"IFERROR(-PMT($B$31,24,NPV($B$31,LC!G7:AC7)),0)","v":0},{"$f":"IFERROR(-PMT($B$31,24,NPV($B$31,LC!H7:AD7)),0)","v":0},{"$f":"IFERROR(-PMT($B$31,24,NPV($B$31,LC!I7:AE7)),0)","v":0},{"$f":"IFERROR(-PMT($B$31,24,NPV($B$31,LC!J7:AF7)),0)","v":0},{"$f":"IFERROR(-PMT($B$31,24,NPV($B$31,LC!K7:AG7)),0)","v":0},{"$f":"IFERROR(-PMT($B$31,24,NPV($B$31,LC!L7:AH7)),0)","v":0},{"$f":"IFERROR(-PMT($B$31,24,NPV($B$31,LC!M7:AI7)),0)","v":0},{"$f":"IFERROR(-PMT($B$31,24,NPV($B$31,LC!N7:AJ7)),0)","v":0},{"$f":"IFERROR(-PMT($B$31,24,NPV($B$31,LC!O7:AK7)),0)","v":0},{"$f":"IFERROR(-PMT($B$31,24,NPV($B$31,LC!P7:AL7)),0)","v":0},{"$f":"IFERROR(-PMT($B$31,24,NPV($B$31,LC!Q7:AM7)),0)","v":0},{"$f":"IFERROR(-PMT($B$31,24,NPV($B$31,LC!R7:AN7)),0)","v":0},{"$f":"IFERROR(-PMT($B$31,24,NPV($B$31,LC!S7:AO7)),0)","v":0},{"$f":"IFERROR(-PMT($B$31,24,NPV($B$31,LC!T7:AP7)),0)","v":0},{"$f":"IFERROR(-PMT($B$31,24,NPV($B$31,LC!U7:AQ7)),0)","v":0},{"$f":"IFERROR(-PMT($B$31,24,NPV($B$31,LC!V7:AR7)),0)","v":0},{"$f":"IFERROR(-PMT($B$31,24,NPV($B$31,LC!W7:AS7)),0)","v":0},{"$f":"IFERROR(-PMT($B$31,24,NPV($B$31,LC!X7:AT7)),0)","v":0},{"$f":"IFERROR(-PMT($B$31,24,NPV($B$31,LC!Y7:AU7)),0)","v":0},{"$f":"IFERROR(-PMT($B$31,24,NPV($B$31,LC!Z7:AV7)),0)","v":0}]
["Variable Peak Pricing",{"$f":"IFERROR(-PMT($B$31,24,NPV($B$31,LC!C8:Y8)),0)","v":0},{"$f":"IFERROR(-PMT($B$31,24,NPV($B$31,LC!D8:Z8)),0)","v":0},{"$f":"IFERROR(-PMT($B$31,24,NPV($B$31,LC!E8:AA8)),0)","v":0},{"$f":"IFERROR(-PMT($B$31,24,NPV($B$31,LC!F8:AB8)),0)","v":0},{"$f":"IFERROR(-PMT($B$31,24,NPV($B$31,LC!G8:AC8)),0)","v":0},{"$f":"IFERROR(-PMT($B$31,24,NPV($B$31,LC!H8:AD8)),0)","v":0},{"$f":"IFERROR(-PMT($B$31,24,NPV($B$31,LC!I8:AE8)),0)","v":0},{"$f":"IFERROR(-PMT($B$31,24,NPV($B$31,LC!J8:AF8)),0)","v":0},{"$f":"IFERROR(-PMT($B$31,24,NPV($B$31,LC!K8:AG8)),0)","v":0},{"$f":"IFERROR(-PMT($B$31,24,NPV($B$31,LC!L8:AH8)),0)","v":0},{"$f":"IFERROR(-PMT($B$31,24,NPV($B$31,LC!M8:AI8)),0)","v":0},{"$f":"IFERROR(-PMT($B$31,24,NPV($B$31,LC!N8:AJ8)),0)","v":0},{"$f":"IFERROR(-PMT($B$31,24,NPV($B$31,LC!O8:AK8)),0)","v":0},{"$f":"IFERROR(-PMT($B$31,24,NPV($B$31,LC!P8:AL8)),0)","v":0},{"$f":"IFERROR(-PMT($B$31,24,NPV($B$31,LC!Q8:AM8)),0)","v":0},{"$f":"IFERROR(-PMT($B$31,24,NPV($B$31,LC!R8:AN8)),0)","v":0},{"$f":"IFERROR(-PMT($B$31,24,NPV($B$31,LC!S8:AO8)),0)","v":0},{"$f":"IFERROR(-PMT($B$31,24,NPV($B$31,LC!T8:AP8)),0)","v":0},{"$f":"IFERROR(-PMT($B$31,24,NPV($B$31,LC!U8:AQ8)),0)","v":0},{"$f":"IFERROR(-PMT($B$31,24,NPV($B$31,LC!V8:AR8)),0)","v":0},{"$f":"IFERROR(-PMT($B$31,24,NPV($B$31,LC!W8:AS8)),0)","v":0},{"$f":"IFERROR(-PMT($B$31,24,NPV($B$31,LC!X8:AT8)),0)","v":0},{"$f":"IFERROR(-PMT($B$31,24,NPV($B$31,LC!Y8:AU8)),0)","v":0},{"$f":"IFERROR(-PMT($B$31,24,NPV($B$31,LC!Z8:AV8)),0)","v":0}]
["Third Party Contracts",{"$f":"-PMT($B$31,24,NPV($B$31,LC!C9:Y9))","v":108078.73484374816},{"$f":"VLOOKUP(C$3,'3rd party cont.'!$A$28:$S$50,19,FALSE)","v":0},{"$f":"VLOOKUP(D$3,'3rd party cont.'!$A$28:$S$50,19,FALSE)","v":93417.990993662708},{"$f":"VLOOKUP(E$3,'3rd party cont.'!$A$28:$S$50,19,FALSE)","v":98160.711167365618},{"$f":"VLOOKUP(F$3,'3rd party cont.'!$A$28:$S$50,19,FALSE)","v":102433.4285127622},{"$f":"VLOOKUP(G$3,'3rd party cont.'!$A$28:$S$50,19,FALSE)","v":106399.40699648421},{"$f":"VLOOKUP(H$3,'3rd party cont.'!$A$28:$S$50,19,FALSE)","v":110235.4125591937},{"$f":"VLOOKUP(I$3,'3rd party cont.'!$A$28:$S$50,19,FALSE)","v":113915.41585660553},{"$f":"VLOOKUP(J$3,'3rd party cont.'!$A$28:$S$50,19,FALSE)","v":117485.73397135676},{"$f":"VLOOKUP(K$3,'3rd party cont.'!$A$28:$S$50,19,FALSE)","v":120953.39959886528},{"$f":"VLOOKUP(L$3,'3rd party cont.'!$A$28:$S$50,19,FALSE)","v":124316.79673681971},{"$f":"VLOOKUP(M$3,'3rd party cont.'!$A$28:$S$50,19,FALSE)","v":127574.28576993324},{"$f":"VLOOKUP(N$3,'3rd party cont.'!$A$28:$S$50,19,FALSE)","v":129126.72703392796},{"$f":"VLOOKUP(O$3,'3rd party cont.'!$A$28:$S$50,19,FALSE)","v":130683.751690701},{"$f":"VLOOKUP(P$3,'3rd party cont.'!$A$28:$S$50,19,FALSE)","v":132249.66165238124},{"$f":"VLOOKUP(Q$3,'3rd party cont.'!$A$28:$S$50,19,FALSE)","v":133824.39828439296},{"$f":"VLOOKUP(R$3,'3rd party cont.'!$A$28:$S$50,19,FALSE)","v":135407.90729434657},{"$f":"VLOOKUP(S$3,'3rd party cont.'!$A$28:$S$50,19,FALSE)","v":137000.66753665087},{"$f":"VLOOKUP(T$3,'3rd party cont.'!$A$28:$S$50,19,FALSE)","v":138602.59913245222},{"$f":"VLOOKUP(U$3,'3rd party cont.'!$A$28:$S$50,19,FALSE)","v":140213.60737843745},{"$f":"VLOOKUP(V$3,'3rd party cont.'!$A$28:$S$50,19,FALSE)","v":141833.57714542936},{"$f":"VLOOKUP(W$3,'3rd party cont.'!$A$28:$S$50,19,FALSE)","v":143462.41606491178},{"$f":"VLOOKUP(X$3,'3rd party cont.'!$A$28:$S$50,19,FALSE)","v":145100.02119930286},{"$f":"VLOOKUP(Y$3,'3rd party cont.'!$A$28:$S$50,19,FALSE)","v":146746.30368404681}]
[]
{"$rows_left_out":24}
{"sheet":"DLC-Smart TS","index":2,"n_rows":400,"n_cols":84,"rows_kept":400,"cut":false,"hidden":false,"merged":[]}
["State Income Tax Rate ............",null,null,1.6402400000000001E-2,null,null,null,null,"Debt ...........................",null,null,0.5,5.1999999999999998E-2,{"$f":"ROUND(L1*M1,4)","v":2.5999999999999999E-2},{"$f":"N1*(1-D2)","v":2.0539999999999999E-2},null,"Gross Revenue",null,null,1]
["Federal Income Tax Rate ........",null,null,0.21,null,null,null,null,"Preferred Stock .................",null,null,0,0,{"$f":"ROUND(L2*M2,4)","v":0},{"$f":"N2","v":0},null,"Uncollectables",null,null,0]
["Discount Factor ......................",null,null,{"$f":"+O4","v":6.8040000000000003E-2},null,null,null,null,"Common Equity ......................",null,null,0.5,9.5000000000000001E-2,{"$f":"ROUND(L3*M3,4)","v":4.7500000000000001E-2},{"$f":"N3","v":4.7500000000000001E-2},null,"Commission Fees",null,null,0]
["Capital Class ...........................",null,null,4,"(1) General Structures.",null,null,null,null,null,null,null,null,{"$f":"SUM(N1:N3)","v":7.3499999999999996E-2},{"$f":"SUM(O1:O3)","v":6.8040000000000003E-2},null,"Excise Tax",null,null,0]
[null,null,null,null,"(2) Generation, Transmission, ",null,null,null,null,null,null,null,null,null,null,null,"Franchise Fees",null,null,0]
[null,null,null,null,"    and Distribution.",null,null,null,null,null,null,null,null,null,null,null,"ERSA",null,null,0]
[null,null,null,null,"(3) Other Equipment.",null,null,null,null,null,null,null,null,"IRR CALC",null,null,null,null,null,"-"]
[null,null,null,null,"(4) Transportation Equipment.",null,null,null,"Principal ......................",null,null,{"$f":"T24","v":8.9248683285242925E-52},null,{"$f":"L8","v":8.9248683285242925E-52},"pv princ",null,"Misc. Revenue Items",null,null,{"$f":"SUM(T2:T6)","v":0}]
["Book Life (Years) ..............",null,null,10,null,null,null,null,"Interest .......................",null,null,{"$f":"D3","v":6.8040000000000003E-2},null,{"$f":"V20","v":0},"pv lvlized margin",null,null,null,null,"-"]
["Property Tax Rate ...............",null,null,1.4999999999999999E-2,null,null,null,null,"Term .............................",null,null,10,null,{"$f":"IRR($AI$28:$AI$102,0.059065190478108)","v":{"$error":"#NUM!"}},"IRR",null,"Before State Income Tax",null,null,{"$f":"T1-T8","v":1}]
{"$rows_left_out":391}
{"sheet":"3rd party cont.","index":3,"n_rows":400,"n_cols":84,"rows_kept":400,"cut":false,"hidden":false,"merged":[]}
["State Income Tax Rate ............",null,null,1.6402400000000001E-2,null,null,null,null,"Debt ...........................",null,null,0.5,5.1999999999999998E-2,{"$f":"ROUND(L1*M1,4)","v":2.5999999999999999E-2},{"$f":"N1*(1-D2)","v":2.0539999999999999E-2},null,"Gross Revenue",null,null,1]
["Federal Income Tax Rate ........",null,null,0.21,null,null,null,null,"Preferred Stock .................",null,null,0,0,{"$f":"ROUND(L2*M2,4)","v":0},{"$f":"N2","v":0},null,"Uncollectables",null,null,0]
["Discount Factor ......................",null,null,{"$f":"+O4","v":6.8040000000000003E-2},null,null,null,null,"Common Equity ......................",null,null,0.5,9.5000000000000001E-2,{"$f":"ROUND(L3*M3,4)","v":4.7500000000000001E-2},{"$f":"N3","v":4.7500000000000001E-2},null,"Commission Fees",null,null,0]
["Capital Class ...........................",null,null,4,"(1) General Structures.",null,null,null,null,null,null,null,null,{"$f":"SUM(N1:N3)","v":7.3499999999999996E-2},{"$f":"SUM(O1:O3)","v":6.8040000000000003E-2},null,"Excise Tax",null,null,0]
[null,null,null,null,"(2) Generation, Transmission, ",null,null,null,null,null,null,null,null,null,null,null,"Franchise Fees",null,null,0]
[null,null,null,null,"    and Distribution.",null,null,null,null,null,null,null,null,null,null,null,"ERSA",null,null,0]
[null,null,null,null,"(3) Other Equipment.",null,null,null,null,null,null,null,null,"IRR CALC",null,null,null,null,null,"-"]
[null,null,null,null,"(4) Transportation Equipment.",null,null,null,"Principal ......................",null,null,{"$f":"T24","v":2.1453694837980991E-52},null,{"$f":"L8","v":2.1453694837980991E-52},"pv princ",null,"Misc. Revenue Items",null,null,{"$f":"SUM(T2:T6)","v":0}]
["Book Life (Years) ..............",null,null,10,null,null,null,null,"Interest .......................",null,null,{"$f":"D3","v":6.8040000000000003E-2},null,{"$f":"V20","v":0},"pv lvlized margin",null,null,null,null,"-"]
["Property Tax Rate ...............",null,null,1.4999999999999999E-2,null,null,null,null,"Term .............................",null,null,10,null,{"$f":"IRR($AI$28:$AI$102,0.059065190478108)","v":{"$error":"#NUM!"}},"IRR",null,"Before State Income Tax",null,null,{"$f":"T1-T8","v":1}]
{"$rows_left_out":391}
{"sheet":"Inflation","index":4,"n_rows":26,"n_cols":2,"rows_kept":26,"cut":false,"hidden":false,"merged":[]}
[]
[]
[2022,100]
[2023,107.19112021857924]
[2024,110.59122255191258]
[2025,113.19265066406601]
[2026,115.72061986223015]
[2027,118.30504703915329]
[2028,120.94719308969438]
[2029,123.60803133766765]
{"$rows_left_out":16}