{"text_format":"1","workbook":"xlsx","n_sheets":5,"sheets":["AEG Input File","LC","DLC-Smart TS","3rd party cont.","Inflation"],"not_rendered":{"charts":1,"images":0,"macros":1,"external_links":1,"defined_names":44,"comments":2,"pivot_tables":0},"unopened":[],"bounds":{"document_bytes":16777216,"sheet_cells":100000,"rows_first":2000,"rows_last":500,"rows_between":2000,"halvings":0,"cell_chars":16384,"cell_head_chars":4096},"cells_cut":0,"cells_raw":0,"read":"whole","date_system":"1900"}

{"sheet":"AEG Input File","index":0,"n_rows":16,"n_cols":76,"rows_kept":16,"cut":false,"hidden":false,"merged":[]}
[null,null,null,null,"Winter Peak Reduction Therms","Winter Peak Reduction Therms","Winter Peak Reduction Therms","Winter Peak Reduction Therms","Winter Peak Reduction Therms","Winter Peak Reduction Therms","Winter Peak Reduction Therms","Winter Peak Reduction Therms","Winter Peak Reduction Therms","Winter Peak Reduction Therms","Winter Peak Reduction Therms","Winter Peak Reduction Therms","Winter Peak Reduction Therms","Winter Peak Reduction Therms","Winter Peak Reduction Therms","Winter Peak Reduction Therms","Winter Peak Reduction Therms","Winter Peak Reduction Therms","Winter Peak Reduction Therms","Winter Peak Reduction Therms","Winter Peak Reduction Therms","Winter Peak Reduction Therms","Winter Peak Reduction Therms","Winter Peak Reduction Therms","Capital Expense Costs","Capital Expense Costs","Capital Expense Costs","Capital Expense Costs","Capital Expense Costs","Capital Expense Costs","Capital Expense Costs","Capital Expense Costs","Capital Expense Costs","Capital Expense Costs","Capital Expense Costs","Capital Expense Costs","Capital Expense Costs","Capital Expense Costs","Capital Expense Costs","Capital Expense Costs","Capital Expense Costs","Capital Expense Costs","Capital Expense Costs","Capital Expense Costs","Capital Expense Costs","Capital Expense Costs","Capital Expense Costs","Capital Expense Costs","O&M Costs","O&M Costs","O&M Costs","O&M Costs","O&M Costs","O&M Costs","O&M Costs","O&M Costs","O&M Costs","O&M Costs","O&M Costs","O&M Costs","O&M Costs","O&M Costs","O&M Costs","O&M Costs","O&M Costs","O&M Costs","O&M Costs","O&M Costs","O&M Costs","O&M Costs","O&M Costs","O&M Costs"]
[null,"Row Labels","Option","Start Year",2023,2024,2025,2026,2027,2028,2029,2030,2031,2032,2033,2034,2035,2036,2037,2038,2039,2040,2041,2042,2043,2044,2045,2046,2023,2024,2025,2026,2027,2028,2029,2030,2031,2032,2033,2034,2035,2036,2037,2038,2039,2040,2041,2042,2043,2044,2045,2046,2023,2024,2025,2026,2027,2028,2029,2030,2031,2032,2033,2034,2035,2036,2037,2038,2039,2040,2041,2042,2043,2044,2045,2046]
[2,"Stand Alone","Behavioral",2023,0,0,0,0,0,0,0,0,0,0,0,0,0,0,0,0,0,0,0,0,0,0,0,0,0,0,0,0,0,0,0,0,0,0,0,0,0,0,0,0,0,0,0,0,0,0,0,0,0,0,0,0,0,0,0,0,0,0,0,0,0,0,0,0,0,0,0,0,0,0,0,0]
[3,"Stand Alone","DLC Water Heating",2023,null,null,null,null,null,null,null,null,null,null,null,null,null,null,null,null,null,null,null,null,null,null,null,null,0,0,0,0,0,0,0,0,0,0,0,0,0,0,0,0,0,0,0,0,0,0,0,0,0,0,0,0,0,0,0,0,0,0,0,0,0,0,0,0,0,0,0,0,0,0,0,0]
[4,"Stand Alone","DLC Smart Thermostats - BYOT",2023,0,6.0236108770656625,18.238736124886501,42.98193838595278,55.736862266896615,62.461552724715453,62.997927830647996,63.539014081027894,64.084853655978989,64.635489119237022,65.190963421681971,65.75131990490317,66.31660230479774,66.886854755202393,67.462121791558886,68.042448354613796,68.627879794152477,69.218461872767918,69.814240769664636,70.415263084497738,71.021575841247952,71.633226492132707,72.250262921553343,72.872733450079267,0,36648.757740196852,72497.740798511484,144805.96813996194,77462.142036511315,43200.187350342749,7698.0422615111775,7761.8770182183616,6885.2806737267802,6934.8887876765793,6985.1076674111182,7035.9465526174235,7087.4144143819931,7139.5143609373063,7192.2530292237971,7245.6442239361413,7299.6829526269494,7354.3880462985626,7409.7650898090615,7465.8157808653914,7522.5507300277877,7579.9820476260884,7638.1070590808085,7696.9481537123238,0,49246.308893609224,89332.199679552316,170569.1692826206,212777.65210985392,235248.94534398051,237327.52696133323,239429.10296250132,241504.85068851779,243602.71851050737,245722.93626565055,247865.73100873586,250031.3381742693,252219.9845281484,254431.91421905399,256667.35872286223,258926.56831387142,261209.77299472879,263517.23403186566,265849.18850305007,268205.8932566758,270587.59723993624,272994.55776094348,275427.03660468402]
[5,"Stand Alone","Time-of-Use",2023,0,0,0,0,0,0,0,0,0,0,0,0,0,0,0,0,0,0,0,0,0,0,0,0,0,0,0,0,0,0,0,0,0,0,0,0,0,0,0,0,0,0,0,0,0,0,0,0,0,0,0,0,0,0,0,0,0,0,0,0,0,0,0,0,0,0,0,0,0,0,0,0]
[6,"Stand Alone","Variable Peak Pricing",2023,0,0,0,0,0,0,0,0,0,0,0,0,0,0,0,0,0,0,0,0,0,0,0,0,0,0,0,0,0,0,0,0,0,0,0,0,0,0,0,0,0,0,0,0,0,0,0,0,0,0,0,0,0,0,0,0,0,0,0,0,0,0,0,0,0,0,0,0,0,0,0,0]
[7,"Stand Alone","Third Party Contracts",2023,0,0.21257222395003583,0.34113605282696946,0.42764135562254973,0.42959097646457556,0.43154948564580825,0.4335169236882675,0.43549333129871276,0.43747874936948661,0.43947321897935981,0.44147678139438168,0.44348947806873396,0.44551135064558817,0.44754244095796736,0.44958279102961229,0.45163244307584965,0.45369143950446666,0.45575982291658762,0.45783763610755612,0.45992492206781987,0.46202172398382074,0.4641280852388876,0.46624404941413433,0.46836966028936178,0,7512.8963250528259,7482.56164414045,7432.177713339046,7393.8574263377814,7355.2164070816098,7316.2618102390197,7277.0008872864546,7237.4409824081904,7197.5895283217078,7157.4540420335697,7117.0421205308303,7076.3614364131217,7035.4197334706332,6994.224822213323,6952.7845753566489,6911.1069232692998,6869.1998493883093,6827.071385607087,6784.7296076417806,6742.1826303815324,6699.43860322807,6656.5057054301305,6613.3921414181441,0,40944.264131635711,40891.0443349212,40691.331304207117,40483.393993281963,40273.715835210998,40062.330038308246,39849.280745153796,39634.605668675635,39418.344740697154,39200.545105208679,38981.237412159368,38760.471308351727,38538.288345860361,38314.728794101276,38089.838221687562,37863.654289304744,37636.226406207425,37407.599262706804,37177.811353287681,36946.909458674032,36714.937313253795,36481.943527581847,36247.967377267014]
[]
[]
[null,null,"Behavioral",null,{"$f":"IFERROR(E3/$AA3,0)","v":0},0,0,0,0,0,0,0,0,0,0,0,0,0,0,0,0,0,0,0,0,0,0]
[null,null,"DLC Water Heating",null,{"$f":"IFERROR(E4/$AA4,0)","v":0},0,0,0,0,0,0,0,0,0,0,0,0,0,0,0,0,0,0,0,0,0,0]
[null,null,"DLC Smart Thermostats - BYOT",null,{"$f":"IFERROR(E5/$AA5,0)","v":0},8.3371473452018799E-2,0.25243833568729629,0.59490355671952333,0.77144165312469015,0.86451661487424469,0.87194046475718445,0.87942952055435697,0.88698436607158027,0.89460559042415999,0.90229378808578042,0.910049558937848,0.91787350831929637,0.92576624707685373,0.93372839161577526,0.94176056395105112,0.94986339175908718,0.95803750842986912,0.96628355311961078,0.97460217080389067,0.98299401233128447,0.99145973447749813,1]
[null,null,"Time-of-Use",null,{"$f":"IFERROR(E6/$AA6,0)","v":0},0,0,0,0,0,0,0,0,0,0,0,0,0,0,0,0,0,0,0,0,0,0]
[null,null,"Variable Peak Pricing",null,{"$f":"IFERROR(E7/$AA7,0)","v":0},0,0,0,0,0,0,0,0,0,0,0,0,0,0,0,0,0,0,0,0,0,0]
{"$rows_left_out":2}
{"sheet":"LC","index":1,"n_rows":33,"n_cols":25,"rows_kept":33,"cut":false,"hidden":false,"merged":[]}
[]
[null,null,2,3,4,5,6,7,8,9,10,11,12,13,14,15,16,17,18,19,20,21,22,23,24]
["Revenue Requirement","Levelization",2023,2024,2025,2026,2027,2028,2029,2030,2031,2032,2033,2034,2035,2036,2037,2038,2039,2040,2041,2042,2043,2044,2045]
["Behavioral",{"$f":"IFERROR(-PMT($B$31,24,NPV($B$31,LC!C4:Y4)),0)","v":0},0,0,0,0,0,0,0,0,0,0,0,0,0,0,0,0,0,0,0,0,0,0,0]
["DLC Water Heating",{"$f":"IFERROR(-PMT($B$31,24,NPV($B$31,LC!C5:Y5)),0)","v":0},0,0,0,0,0,0,0,0,0,0,0,0,0,0,0,0,0,0,0,0,0,0,0]
["DLC Smart Thermostats - BYOT",{"$f":"IFERROR(-PMT($B$31,24,NPV($B$31,LC!C6:Y6)),0)","v":301348.68882008328},{"$f":"VLOOKUP(C$3,'DLC-Smart TS'!$A$28:$S$50,19,FALSE)","v":0},{"$f":"VLOOKUP(D$3,'DLC-Smart TS'!$A$28:$S$50,19,FALSE)","v":62212.458991218387},{"$f":"VLOOKUP(E$3,'DLC-Smart TS'!$A$28:$S$50,19,FALSE)","v":124262.08818081362},{"$f":"VLOOKUP(F$3,'DLC-Smart TS'!$A$28:$S$50,19,FALSE)","v":251441.09642444842},{"$f":"VLOOKUP(G$3,'DLC-Smart TS'!$A$28:$S$50,19,FALSE)","v":319845.43851137464},{"$f":"VLOOKUP(H$3,'DLC-Smart TS'!$A$28:$S$50,19,FALSE)","v":358053.52079662599},{"$f":"VLOOKUP(I$3,'DLC-Smart TS'!$A$28:$S$50,19,FALSE)","v":363710.25020248041},{"$f":"VLOOKUP(J$3,'DLC-Smart TS'!$A$28:$S$50,19,FALSE)","v":369955.89595313004},{"$f":"VLOOKUP(K$3,'DLC-Smart TS'!$A$28:$S$50,19,FALSE)","v":376475.94022879243},{"$f":"VLOOKUP(L$3,'DLC-Smart TS'!$A$28:$S$50,19,FALSE)","v":383545.43469272542},{"$f":"VLOOKUP(M$3,'DLC-Smart TS'!$A$28:$S$50,19,FALSE)","v":391086.88770353526},{"$f":"VLOOKUP(N$3,'DLC-Smart TS'!$A$28:$S$50,19,FALSE)","v":395103.62041675847},{"$f":"VLOOKUP(O$3,'DLC-Smart TS'!$A$28:$S$50,19,FALSE)","v":395780.24255456205},{"$f":"VLOOKUP(P$3,'DLC-Smart TS'!$A$28:$S$50,19,FALSE)","v":389219.18508122547},{"$f":"VLOOKUP(Q$3,'DLC-Smart TS'!$A$28:$S$50,19,FALSE)","v":391674.30208309297},{"$f":"VLOOKUP(R$3,'DLC-Smart TS'!$A$28:$S$50,19,FALSE)","v":399005.82604551845},{"$f":"VLOOKUP(S$3,'DLC-Smart TS'!$A$28:$S$50,19,FALSE)","v":411216.62932479987},{"$f":"VLOOKUP(T$3,'DLC-Smart TS'!$A$28:$S$50,19,FALSE)","v":423821.34254064923},{"$f":"VLOOKUP(U$3,'DLC-Smart TS'!$A$28:$S$50,19,FALSE)","v":436949.50679382659},{"$f":"VLOOKUP(V$3,'DLC-Smart TS'!$A$28:$S$50,19,FALSE)","v":450491.64284595684},{"$f":"VLOOKUP(W$3,'DLC-Smart TS'!$A$28:$S$50,19,FALSE)","v":464460.96910142945},{"$f":"VLOOKUP(X$3,'DLC-Smart TS'!$A$28:$S$50,19,FALSE)","v":478871.11275899288},{"$f":"VLOOKUP(Y$3,'DLC-Smart TS'!$A$28:$S$50,19,FALSE)","v":493736.14487786609}]
["Time-of-Use",{"$f":"IFERROR(-PMT($B$31,24,NPV($B$31,LC!C7:Y7)),0)","v":0},0,0,0,0,0,0,0,0,0,0,0,0,0,0,0,0,0,0,0,0,0,0,0]
["Variable Peak Pricing",{"$f":"IFERROR(-PMT($B$31,24,NPV($B$31,LC!C8:Y8)),0)","v":0},0,0,0,0,0,0,0,0,0,0,0,0,0,0,0,0,0,0,0,0,0,0,0]
["Third Party Contracts",{"$f":"IFERROR(-PMT($B$31,24,NPV($B$31,LC!C9:Y9)),0)","v":55895.690236460767},{"$f":"VLOOKUP(C$3,'3rd party cont.'!$A$28:$S$50,19,FALSE)","v":0},{"$f":"VLOOKUP(D$3,'3rd party cont.'!$A$28:$S$50,19,FALSE)","v":46744.801542509274},{"$f":"VLOOKUP(E$3,'3rd party cont.'!$A$28:$S$50,19,FALSE)","v":49298.473673750181},{"$f":"VLOOKUP(F$3,'3rd party cont.'!$A$28:$S$50,19,FALSE)","v":51565.976779654535},{"$f":"VLOOKUP(G$3,'3rd party cont.'!$A$28:$S$50,19,FALSE)","v":53768.810397343426},{"$f":"VLOOKUP(H$3,'3rd party cont.'!$A$28:$S$50,19,FALSE)","v":55918.880572548085},{"$f":"VLOOKUP(I$3,'3rd party cont.'!$A$28:$S$50,19,FALSE)","v":58002.727109637977},{"$f":"VLOOKUP(J$3,'3rd party cont.'!$A$28:$S$50,19,FALSE)","v":60043.578654615951},{"$f":"VLOOKUP(K$3,'3rd party cont.'!$A$28:$S$50,19,FALSE)","v":62044.87465717773},{"$f":"VLOOKUP(L$3,'3rd party cont.'!$A$28:$S$50,19,FALSE)","v":64005.732314202694},{"$f":"VLOOKUP(M$3,'3rd party cont.'!$A$28:$S$50,19,FALSE)","v":65925.259601542217},{"$f":"VLOOKUP(N$3,'3rd party cont.'!$A$28:$S$50,19,FALSE)","v":67003.202077192254},{"$f":"VLOOKUP(O$3,'3rd party cont.'!$A$28:$S$50,19,FALSE)","v":68091.874570459142},{"$f":"VLOOKUP(P$3,'3rd party cont.'!$A$28:$S$50,19,FALSE)","v":69194.590522273327},{"$f":"VLOOKUP(Q$3,'3rd party cont.'!$A$28:$S$50,19,FALSE)","v":70309.954101852418},{"$f":"VLOOKUP(R$3,'3rd party cont.'!$A$28:$S$50,19,FALSE)","v":71438.043007829809},{"$f":"VLOOKUP(S$3,'3rd party cont.'!$A$28:$S$50,19,FALSE)","v":72579.206339881566},{"$f":"VLOOKUP(T$3,'3rd party cont.'!$A$28:$S$50,19,FALSE)","v":73733.511356979914},{"$f":"VLOOKUP(U$3,'3rd party cont.'!$A$28:$S$50,19,FALSE)","v":74901.017441295146},{"$f":"VLOOKUP(V$3,'3rd party cont.'!$A$28:$S$50,19,FALSE)","v":76081.772915894471},{"$f":"VLOOKUP(W$3,'3rd party cont.'!$A$28:$S$50,19,FALSE)","v":77275.838149384654},{"$f":"VLOOKUP(X$3,'3rd party cont.'!$A$28:$S$50,19,FALSE)","v":78483.267720123622},{"$f":"VLOOKUP(Y$3,'3rd party cont.'!$A$28:$S$50,19,FALSE)","v":79704.123720364514}]
[]
["Dth","Avg"]
["Behavioral",{"$f":"AVERAGE(C12:Y12)","v":0},{"$f":"HLOOKUP(C$3,'AEG Input File'!$E$2:$AB$8,2,FALSE)","v":0},{"$f":"HLOOKUP(D$3,'AEG Input File'!$E$2:$AB$8,2,FALSE)","v":0},{"$f":"HLOOKUP(E$3,'AEG Input File'!$E$2:$AB$8,2,FALSE)","v":0},{"$f":"HLOOKUP(F$3,'AEG Input File'!$E$2:$AB$8,2,FALSE)","v":0},{"$f":"HLOOKUP(G$3,'AEG Input File'!$E$2:$AB$8,2,FALSE)","v":0},{"$f":"HLOOKUP(H$3,'AEG Input File'!$E$2:$AB$8,2,FALSE)","v":0},{"$f":"HLOOKUP(I$3,'AEG Input File'!$E$2:$AB$8,2,FALSE)","v":0},{"$f":"HLOOKUP(J$3,'AEG Input File'!$E$2:$AB$8,2,FALSE)","v":0},{"$f":"HLOOKUP(K$3,'AEG Input File'!$E$2:$AB$8,2,FALSE)","v":0},{"$f":"HLOOKUP(L$3,'AEG Input File'!$E$2:$AB$8,2,FALSE)","v":0},{"$f":"HLOOKUP(M$3,'AEG Input File'!$E$2:$AB$8,2,FALSE)","v":0},{"$f":"HLOOKUP(N$3,'AEG Input File'!$E$2:$AB$8,2,FALSE)","v":0},{"$f":"HLOOKUP(O$3,'AEG Input File'!$E$2:$AB$8,2,FALSE)","v":0},{"$f":"HLOOKUP(P$3,'AEG Input File'!$E$2:$AB$8,2,FALSE)","v":0},{"$f":"HLOOKUP(Q$3,'AEG Input File'!$E$2:$AB$8,2,FALSE)","v":0},{"$f":"HLOOKUP(R$3,'AEG Input File'!$E$2:$AB$8,2,FALSE)","v":0},{"$f":"HLOOKUP(S$3,'AEG Input File'!$E$2:$AB$8,2,FALSE)","v":0},{"$f":"HLOOKUP(T$3,'AEG Input File'!$E$2:$AB$8,2,FALSE)","v":0},{"$f":"HLOOKUP(U$3,'AEG Input File'!$E$2:$AB$8,2,FALSE)","v":0},{"$f":"HLOOKUP(V$3,'AEG Input File'!$E$2:$AB$8,2,FALSE)","v":0},{"$f":"HLOOKUP(W$3,'AEG Input File'!$E$2:$AB$8,2,FALSE)","v":0},{"$f":"HLOOKUP(X$3,'AEG Input File'!$E$2:$AB$8,2,FALSE)","v":0},{"$f":"HLOOKUP(Y$3,'AEG Input File'!$E$2:$AB$8,2,FALSE)","v":0}]
["DLC Water Heating",{"$f":"AVERAGE(C13:Y13)","v":0},{"$f":"HLOOKUP(C$3,'AEG Input File'!$E$2:$AB$8,3,FALSE)","v":0},{"$f":"HLOOKUP(D$3,'AEG Input File'!$E$2:$AB$8,3,FALSE)","v":0},{"$f":"HLOOKUP(E$3,'AEG Input File'!$E$2:$AB$8,3,FALSE)","v":0},{"$f":"HLOOKUP(F$3,'AEG Input File'!$E$2:$AB$8,3,FALSE)","v":0},{"$f":"HLOOKUP(G$3,'AEG Input File'!$E$2:$AB$8,3,FALSE)","v":0},{"$f":"HLOOKUP(H$3,'AEG Input File'!$E$2:$AB$8,3,FALSE)","v":0},{"$f":"HLOOKUP(I$3,'AEG Input File'!$E$2:$AB$8,3,FALSE)","v":0},{"$f":"HLOOKUP(J$3,'AEG Input File'!$E$2:$AB$8,3,FALSE)","v":0},{"$f":"HLOOKUP(K$3,'AEG Input File'!$E$2:$AB$8,3,FALSE)","v":0},{"$f":"HLOOKUP(L$3,'AEG Input File'!$E$2:$AB$8,3,FALSE)","v":0},{"$f":"HLOOKUP(M$3,'AEG Input File'!$E$2:$AB$8,3,FALSE)","v":0},{"$f":"HLOOKUP(N$3,'AEG Input File'!$E$2:$AB$8,3,FALSE)","v":0},{"$f":"HLOOKUP(O$3,'AEG Input File'!$E$2:$AB$8,3,FALSE)","v":0},{"$f":"HLOOKUP(P$3,'AEG Input File'!$E$2:$AB$8,3,FALSE)","v":0},{"$f":"HLOOKUP(Q$3,'AEG Input File'!$E$2:$AB$8,3,FALSE)","v":0},{"$f":"HLOOKUP(R$3,'AEG Input File'!$E$2:$AB$8,3,FALSE)","v":0},{"$f":"HLOOKUP(S$3,'AEG Input File'!$E$2:$AB$8,3,FALSE)","v":0},{"$f":"HLOOKUP(T$3,'AEG Input File'!$E$2:$AB$8,3,FALSE)","v":0},{"$f":"HLOOKUP(U$3,'AEG Input File'!$E$2:$AB$8,3,FALSE)","v":0},{"$f":"HLOOKUP(V$3,'AEG Input File'!$E$2:$AB$8,3,FALSE)","v":0},{"$f":"HLOOKUP(W$3,'AEG Input File'!$E$2:$AB$8,3,FALSE)","v":0},{"$f":"HLOOKUP(X$3,'AEG Input File'!$E$2:$AB$8,3,FALSE)","v":0},{"$f":"HLOOKUP(Y$3,'AEG Input File'!$E$2:$AB$8,3,FALSE)","v":0}]
["DLC Smart Thermostats - BYOT",57.970922016312336,{"$f":"HLOOKUP(C$3,'AEG Input File'!$E$2:$AB$8,4,FALSE)","v":0},{"$f":"HLOOKUP(D$3,'AEG Input File'!$E$2:$AB$8,4,FALSE)","v":6.0236108770656625},{"$f":"HLOOKUP(E$3,'AEG Input File'!$E$2:$AB$8,4,FALSE)","v":18.238736124886501},{"$f":"HLOOKUP(F$3,'AEG Input File'!$E$2:$AB$8,4,FALSE)","v":42.98193838595278},{"$f":"HLOOKUP(G$3,'AEG Input File'!$E$2:$AB$8,4,FALSE)","v":55.736862266896615},{"$f":"HLOOKUP(H$3,'AEG Input File'!$E$2:$AB$8,4,FALSE)","v":62.461552724715453},{"$f":"HLOOKUP(I$3,'AEG Input File'!$E$2:$AB$8,4,FALSE)","v":62.997927830647996},{"$f":"HLOOKUP(J$3,'AEG Input File'!$E$2:$AB$8,4,FALSE)","v":63.539014081027894},{"$f":"HLOOKUP(K$3,'AEG Input File'!$E$2:$AB$8,4,FALSE)","v":64.084853655978989},{"$f":"HLOOKUP(L$3,'AEG Input File'!$E$2:$AB$8,4,FALSE)","v":64.635489119237022},{"$f":"HLOOKUP(M$3,'AEG Input File'!$E$2:$AB$8,4,FALSE)","v":65.190963421681971},{"$f":"HLOOKUP(N$3,'AEG Input File'!$E$2:$AB$8,4,FALSE)","v":65.75131990490317},{"$f":"HLOOKUP(O$3,'AEG Input File'!$E$2:$AB$8,4,FALSE)","v":66.31660230479774},{"$f":"HLOOKUP(P$3,'AEG Input File'!$E$2:$AB$8,4,FALSE)","v":66.886854755202393},{"$f":"HLOOKUP(Q$3,'AEG Input File'!$E$2:$AB$8,4,FALSE)","v":67.462121791558886},{"$f":"HLOOKUP(R$3,'AEG Input File'!$E$2:$AB$8,4,FALSE)","v":68.042448354613796},{"$f":"HLOOKUP(S$3,'AEG Input File'!$E$2:$AB$8,4,FALSE)","v":68.627879794152477},{"$f":"HLOOKUP(T$3,'AEG Input File'!$E$2:$AB$8,4,FALSE)","v":69.218461872767918},{"$f":"HLOOKUP(U$3,'AEG Input File'!$E$2:$AB$8,4,FALSE)","v":69.814240769664636},{"$f":"HLOOKUP(V$3,'AEG Input File'!$E$2:$AB$8,4,FALSE)","v":70.415263084497738},{"$f":"HLOOKUP(W$3,'AEG Input File'!$E$2:$AB$8,4,FALSE)","v":71.021575841247952},{"$f":"HLOOKUP(X$3,'AEG Input File'!$E$2:$AB$8,4,FALSE)","v":71.633226492132707},{"$f":"HLOOKUP(Y$3,'AEG Input File'!$E$2:$AB$8,4,FALSE)","v":72.250262921553343}]
["Time-of-Use",0,{"$f":"HLOOKUP(C$3,'AEG Input File'!$E$2:$AB$8,5,FALSE)","v":0},{"$f":"HLOOKUP(D$3,'AEG Input File'!$E$2:$AB$8,5,FALSE)","v":0},{"$f":"HLOOKUP(E$3,'AEG Input File'!$E$2:$AB$8,5,FALSE)","v":0},{"$f":"HLOOKUP(F$3,'AEG Input File'!$E$2:$AB$8,5,FALSE)","v":0},{"$f":"HLOOKUP(G$3,'AEG Input File'!$E$2:$AB$8,5,FALSE)","v":0},{"$f":"HLOOKUP(H$3,'AEG Input File'!$E$2:$AB$8,5,FALSE)","v":0},{"$f":"HLOOKUP(I$3,'AEG Input File'!$E$2:$AB$8,5,FALSE)","v":0},{"$f":"HLOOKUP(J$3,'AEG Input File'!$E$2:$AB$8,5,FALSE)","v":0},{"$f":"HLOOKUP(K$3,'AEG Input File'!$E$2:$AB$8,5,FALSE)","v":0},{"$f":"HLOOKUP(L$3,'AEG Input File'!$E$2:$AB$8,5,FALSE)","v":0},{"$f":"HLOOKUP(M$3,'AEG Input File'!$E$2:$AB$8,5,FALSE)","v":0},{"$f":"HLOOKUP(N$3,'AEG Input File'!$E$2:$AB$8,5,FALSE)","v":0},{"$f":"HLOOKUP(O$3,'AEG Input File'!$E$2:$AB$8,5,FALSE)","v":0},{"$f":"HLOOKUP(P$3,'AEG Input File'!$E$2:$AB$8,5,FALSE)","v":0},{"$f":"HLOOKUP(Q$3,'AEG Input File'!$E$2:$AB$8,5,FALSE)","v":0},{"$f":"HLOOKUP(R$3,'AEG Input File'!$E$2:$AB$8,5,FALSE)","v":0},{"$f":"HLOOKUP(S$3,'AEG Input File'!$E$2:$AB$8,5,FALSE)","v":0},{"$f":"HLOOKUP(T$3,'AEG Input File'!$E$2:$AB$8,5,FALSE)","v":0},{"$f":"HLOOKUP(U$3,'AEG Input File'!$E$2:$AB$8,5,FALSE)","v":0},{"$f":"HLOOKUP(V$3,'AEG Input File'!$E$2:$AB$8,5,FALSE)","v":0},{"$f":"HLOOKUP(W$3,'AEG Input File'!$E$2:$AB$8,5,FALSE)","v":0},{"$f":"HLOOKUP(X$3,'AEG Input File'!$E$2:$AB$8,5,FALSE)","v":0},{"$f":"HLOOKUP(Y$3,'AEG Input File'!$E$2:$AB$8,5,FALSE)","v":0}]
{"$rows_left_out":19}
{"sheet":"DLC-Smart TS","index":2,"n_rows":400,"n_cols":84,"rows_kept":400,"cut":false,"hidden":false,"merged":[]}
["State Income Tax Rate ............",null,null,1.6402400000000001E-2,null,null,null,null,"Debt ...........................",null,null,0.5,5.1999999999999998E-2,{"$f":"ROUND(L1*M1,4)","v":2.5999999999999999E-2},{"$f":"N1*(1-D2)","v":2.0539999999999999E-2},null,"Gross Revenue",null,null,1]
["Federal Income Tax Rate ........",null,null,0.21,null,null,null,null,"Preferred Stock .................",null,null,0,0,{"$f":"ROUND(L2*M2,4)","v":0},{"$f":"N2","v":0},null,"Uncollectables",null,null,0]
["Discount Factor ......................",null,null,{"$f":"+O4","v":6.8040000000000003E-2},null,null,null,null,"Common Equity ......................",null,null,0.5,9.5000000000000001E-2,{"$f":"ROUND(L3*M3,4)","v":4.7500000000000001E-2},{"$f":"N3","v":4.7500000000000001E-2},null,"Commission Fees",null,null,0]
["Capital Class ...........................",null,null,4,"(1) General Structures.",null,null,null,null,null,null,null,null,{"$f":"SUM(N1:N3)","v":7.3499999999999996E-2},{"$f":"SUM(O1:O3)","v":6.8040000000000003E-2},null,"Excise Tax",null,null,0]
[null,null,null,null,"(2) Generation, Transmission, ",null,null,null,null,null,null,null,null,null,null,null,"Franchise Fees",null,null,0]
[null,null,null,null,"    and Distribution.",null,null,null,null,null,null,null,null,null,null,null,"ERSA",null,null,0]
[null,null,null,null,"(3) Other Equipment.",null,null,null,null,null,null,null,null,"IRR CALC",null,null,null,null,null,"-"]
[null,null,null,null,"(4) Transportation Equipment.",null,null,null,"Principal ......................",null,null,{"$f":"T24","v":5.8926545194685726E-52},null,{"$f":"L8","v":5.8926545194685726E-52},"pv princ",null,"Misc. Revenue Items",null,null,{"$f":"SUM(T2:T6)","v":0}]
["Book Life (Years) ..............",null,null,10,null,null,null,null,"Interest .......................",null,null,{"$f":"D3","v":6.8040000000000003E-2},null,{"$f":"V20","v":0},"pv lvlized margin",null,null,null,null,"-"]
["Property Tax Rate ...............",null,null,1.4999999999999999E-2,null,null,null,null,"Term .............................",null,null,10,null,{"$f":"IRR($AI$28:$AI$102,0.059065190478108)","v":{"$error":"#NUM!"}},"IRR",null,"Before State Income Tax",null,null,{"$f":"T1-T8","v":1}]
["O&M Escalation Factor ..........",null,null,0.03,null,null,null,null,"Levelized Gr. Mar. Requirement .......",null,null,{"$f":"PMT($L$9,$L$10,-$L$8)","v":8.3139633660548568E-53},null,null,null,null,"State Income Tax",null,null,0]
[null,null,null,null,null,null,null,null,null,null,null,null,null,null,null,null,null,null,null,"-"]
[null,"Idaho","Oregon","Washington",null,null,null,null,null,null,null,null,null,null,null,null,"Before Federal Income Tax",null,null,{"$f":"T10-T11","v":1}]
["Electric",0.35,0,0.65,{"$f":"SUM(B14:D14)","v":1},null,null,null,null,null,"Lev ROE",{"$f":"PMT(L9,L10,-L15)","v":10140.356145981688},null,null,null,null,"Federal Income Tax",null,null,{"$f":"T13*D2","v":0.21},null,"(v)","(w)","(x)","(y)","(z)","(aa)","(ab)","(ac)","(ad)","(ae)","(af)","(ag)","(ah)"]
["Gas",0,0,0,{"$f":"SUM(B15:D15)","v":0},null,null,null,null,null,"NPV equity",{"$f":"NPV(L9,$M$28:$M$103)","v":71871.396158189003},null,null,null,null,null,null,null,"-",null,"PV GM"]
{"$rows_left_out":386}
{"sheet":"3rd party cont.","index":3,"n_rows":400,"n_cols":84,"rows_kept":400,"cut":false,"hidden":false,"merged":[]}
["State Income Tax Rate ............",null,null,1.6402400000000001E-2,null,null,null,null,"Debt ...........................",null,null,0.5,5.1999999999999998E-2,{"$f":"ROUND(L1*M1,4)","v":2.5999999999999999E-2},{"$f":"N1*(1-D2)","v":2.0539999999999999E-2},null,"Gross Revenue",null,null,1]
["Federal Income Tax Rate ........",null,null,0.21,null,null,null,null,"Preferred Stock .................",null,null,0,0,{"$f":"ROUND(L2*M2,4)","v":0},{"$f":"N2","v":0},null,"Uncollectables",null,null,0]
["Discount Factor ......................",null,null,{"$f":"+O4","v":6.8040000000000003E-2},null,null,null,null,"Common Equity ......................",null,null,0.5,9.5000000000000001E-2,{"$f":"ROUND(L3*M3,4)","v":4.7500000000000001E-2},{"$f":"N3","v":4.7500000000000001E-2},null,"Commission Fees",null,null,0]
["Capital Class ...........................",null,null,4,"(1) General Structures.",null,null,null,null,null,null,null,null,{"$f":"SUM(N1:N3)","v":7.3499999999999996E-2},{"$f":"SUM(O1:O3)","v":6.8040000000000003E-2},null,"Excise Tax",null,null,0]
[null,null,null,null,"(2) Generation, Transmission, ",null,null,null,null,null,null,null,null,null,null,null,"Franchise Fees",null,null,0]
[null,null,null,null,"    and Distribution.",null,null,null,null,null,null,null,null,null,null,null,"ERSA",null,null,0]
[null,null,null,null,"(3) Other Equipment.",null,null,null,null,null,null,null,null,"IRR CALC",null,null,null,null,null,"-"]
[null,null,null,null,"(4) Transportation Equipment.",null,null,null,"Principal ......................",null,null,{"$f":"T24","v":1.1099755738851892E-52},null,{"$f":"L8","v":1.1099755738851892E-52},"pv princ",null,"Misc. Revenue Items",null,null,{"$f":"SUM(T2:T6)","v":0}]
["Book Life (Years) ..............",null,null,10,null,null,null,null,"Interest .......................",null,null,{"$f":"D3","v":6.8040000000000003E-2},null,{"$f":"V20","v":0},"pv lvlized margin",null,null,null,null,"-"]
["Property Tax Rate ...............",null,null,1.4999999999999999E-2,null,null,null,null,"Term .............................",null,null,10,null,{"$f":"IRR($AI$28:$AI$102,0.059065190478108)","v":{"$error":"#NUM!"}},"IRR",null,"Before State Income Tax",null,null,{"$f":"T1-T8","v":1}]
["O&M Escalation Factor ..........",null,null,0.03,null,null,null,null,"Levelized Gr. Mar. Requirement .......",null,null,{"$f":"PMT($L$9,$L$10,-$L$8)","v":1.5660677591072198E-53},null,null,null,null,"State Income Tax",null,null,0]
[null,null,null,null,null,null,null,null,null,null,null,null,null,null,null,null,null,null,null,"-"]
[null,"Idaho","Oregon","Washington",null,null,null,null,null,null,null,null,null,null,null,null,"Before Federal Income Tax",null,null,{"$f":"T10-T11","v":1}]
["Electric",0.35,0,0.65,{"$f":"SUM(B14:D14)","v":1},null,null,null,null,null,"Lev ROE",{"$f":"PMT(L9,L10,-L15)","v":2525.7123581741362},null,null,null,null,"Federal Income Tax",null,null,{"$f":"T13*D2","v":0.21},null,"(v)","(w)","(x)","(y)","(z)","(aa)","(ab)","(ac)","(ad)","(ae)","(af)","(ag)","(ah)"]
["Gas",0,0,0,{"$f":"SUM(B15:D15)","v":0},null,null,null,null,null,"NPV equity",{"$f":"NPV(L9,$M$28:$M$103)","v":17901.390332123636},null,null,null,null,null,null,null,"-",null,"PV GM"]
{"$rows_left_out":386}
{"sheet":"Inflation","index":4,"n_rows":26,"n_cols":2,"rows_kept":26,"cut":false,"hidden":false,"merged":[]}
[]
[]
[2022,100]
[2023,107.19112021857924]
[2024,110.59122255191258]
[2025,113.19265066406601]
[2026,115.72061986223015]
[2027,118.30504703915329]
[2028,120.94719308969438]
[2029,123.60803133766765]
[2030,126.32740802709634]
[2031,129.10661100369245]
[2032,131.94695644577368]
[2033,134.84978948758069]
[2034,137.81648485630748]
{"$rows_left_out":11}